Reaction Details
Target5-hydroxytryptamine receptor 2C
LigandBDBM50257614
Substrate/Competitorn/a
Meas. Tech.ChEMBL_567049 (CHEMBL1029957)
Ki 51±n/a nM
Citation Fish, PVBrown, ADEvrard, ERoberts, LR 7-Sulfonamido-3-benzazepines as potent and selective 5-HT2C receptor agonists: hit-to-lead optimization. Bioorg Med Chem Lett19:1871-5 (2009) 
 
5-hydroxytryptamine receptor 2C
Name:5-hydroxytryptamine receptor 2C
Type:G Protein-Coupled Receptor (GPCR)
Mol. Mass.:51836.79
Organism:Homo sapiens (Human)
Description:P28335
Residue:458
BDBM50257614
NameBDBM50257614
Synonyms:7-(pyrrolidin-1-ylsulfonyl)-2,3,4,5-tetrahydro-1H-benzo[d]azepine | CHEMBL522514
TypeSmall organic molecule
Emp. Form.C14H20N2O2S
Mol. Mass.280.386
SMILESO=S(=O)(N1CCCC1)c1ccc2CCNCCc2c1