Reaction Details
Target5-hydroxytryptamine receptor 2C
LigandBDBM50257617
Substrate/Competitorn/a
Meas. Tech.ChEMBL_566811 (CHEMBL957620)
EC50 41±n/a nM
Citation Fish, PVBrown, ADEvrard, ERoberts, LR 7-Sulfonamido-3-benzazepines as potent and selective 5-HT2C receptor agonists: hit-to-lead optimization. Bioorg Med Chem Lett19:1871-5 (2009) 
 
5-hydroxytryptamine receptor 2C
Name:5-hydroxytryptamine receptor 2C
Type:G Protein-Coupled Receptor (GPCR)
Mol. Mass.:51836.79
Organism:Homo sapiens (Human)
Description:P28335
Residue:458
BDBM50257617
NameBDBM50257617
Synonyms:CHEMBL492556 | N-((2,3-dihydrobenzofuran-3-yl)methyl)-N-methyl-2,3,4,5-tetrahydro-1H-benzo[d]azepine-7-sulfonamide
TypeSmall organic molecule
Emp. Form.C20H24N2O3S
Mol. Mass.372.481
SMILESCN(CC1COc2ccccc12)S(=O)(=O)c1ccc2CCNCCc2c1