Reaction Details
TargetDipeptidyl peptidase 2
LigandBDBM11695
Substrate/Competitorn/a
Meas. Tech.ChEMBL_567093 (CHEMBL1030772)
IC50>20000±n/a nM
Citation Tsai, TYHsu, TChen, CTCheng, JHChiou, MCHuang, CHTseng, YJYeh, TKHuang, CYYeh, KCHuang, YWWu, SHWang, MHChen, XChao, YSJiaang, WT Rational design and synthesis of potent and long-lasting glutamic acid-based dipeptidyl peptidase IV inhibitors. Bioorg Med Chem Lett19:1908-12 (2009) 
 
Dipeptidyl peptidase 2
Name:Dipeptidyl peptidase 2
Type:Protein
Mol. Mass.:54339.29
Organism:Homo sapiens (Human)
Description:Q9UHL4
Residue:492
BDBM11695
NameBDBM11695
Synonyms:(2S)-1-{2-[(3-hydroxyadamantan-1-yl)amino]acetyl}pyrrolidine-2-carbonitrile NVP-LAF237
TypeSmall organic molecule
Emp. Form.C17H25N3O2
Mol. Mass.303.3993
SMILESOC12CC3CC(C1)CC(C3)(C2)NCC(=O)N1CCC[C@H]1C#N