Reaction Details
TargetDipeptidyl peptidase 4
LigandBDBM50256935
Substrate/Competitorn/a
Meas. Tech.ChEMBL_567091 (CHEMBL1030770)
IC50 8±n/a nM
Citation Tsai, TYHsu, TChen, CTCheng, JHChiou, MCHuang, CHTseng, YJYeh, TKHuang, CYYeh, KCHuang, YWWu, SHWang, MHChen, XChao, YSJiaang, WT Rational design and synthesis of potent and long-lasting glutamic acid-based dipeptidyl peptidase IV inhibitors. Bioorg Med Chem Lett19:1908-12 (2009) 
 
Dipeptidyl peptidase 4
Name:Dipeptidyl peptidase 4
Type:Enzyme
Mol. Mass.:88271.01
Organism:Homo sapiens (Human)
Description:P27487
Residue:766
BDBM50256935
NameBDBM50256935
Synonyms:(2S,3R)-1-((S)-2-cyanopyrrolidin-1-yl)-3-methyl-1,5-dioxo-5-(3-(trifluoromethyl)-5,6-dihydro-[1,2,4]triazolo[4,3-a]pyrazin-7(8H)-yl)pentan-2-aminium 2,2,2-trifluoroacetate | CHEMBL475662
TypeSmall organic molecule
Emp. Form.C17H23F3N7O2
Mol. Mass.414.4049
SMILESC[C@H](CC(=O)N1CCn2c(C1)nnc2C(F)(F)F)[C@H]([NH3+])C(=O)N1CCC[C@H]1C#N