Reaction Details
TargetGonadotropin-releasing hormone receptor
LigandBDBM50256883
Substrate/Competitorn/a
Meas. Tech.ChEMBL_562461 (CHEMBL1010964)
IC50 830±n/a nM
Citation Pelletier, JCChengalvala, MVCottom, JEFeingold, IBGreen, DMHauze, DBHuselton, CAJetter, JWKopf, GSLundquist, JTMagolda, RLMann, CWMehlmann, JFRogers, JFShanno, LKAdams, WRTio, COWrobel, JE Discovery of 6-({4-[2-(4-tert-butylphenyl)-1H-benzimidazol-4-yl]piperazin-1-yl}methyl)quinoxaline (WAY-207024): an orally active antagonist of the gonadotropin releasing hormone receptor (GnRH-R). J Med Chem52:2148-52 (2009) 
 
Gonadotropin-releasing hormone receptor
Name:Gonadotropin-releasing hormone receptor
Type:PROTEIN
Mol. Mass.:37767.60
Organism:Rattus norvegicus
Description:ChEMBL_1335047
Residue:327
BDBM50256883
NameBDBM50256883
Synonyms:6-((4-(2-(4-tert-butylphenyl)-1H-benzo[d]imidazol-4-yl)piperazin-1-yl)methyl)quinoline | CHEMBL474992
TypeSmall organic molecule
Emp. Form.C31H33N5
Mol. Mass.475.6272
SMILESCC(C)(C)c1ccc(cc1)-c1nc2c(cccc2[nH]1)N1CCN(Cc2ccc3ncccc3c2)CC1