Reaction Details
TargetRAC-gamma serine/threonine-protein kinase
LigandBDBM50278837
Substrate/Competitorn/a
Meas. Tech.ChEMBL_565650 (CHEMBL959246)
IC50 2±n/a nM
Citation Seefeld, MARouse, MBMcNulty, KCSun, LWang, JYamashita, DSLuengo, JIZhang, SMinthorn, EAConcha, NOHeerding, DA Discovery of 5-pyrrolopyridinyl-2-thiophenecarboxamides as potent AKT kinase inhibitors. Bioorg Med Chem Lett19:2244-8 (2009) 
 
RAC-gamma serine/threonine-protein kinase
Name:RAC-gamma serine/threonine-protein kinase
Type:Enzyme
Mol. Mass.:55769.36
Organism:Homo sapiens (Human)
Description:n/a
Residue:479
BDBM50278837
NameBDBM50278837
Synonyms:CHEMBL496690 | N-((S)-1-amino-3-(4-fluorophenyl)propan-2-yl)-4-bromo-5-(1H-pyrrolo[2,3-b]pyridin-4-yl)thiophene-2-carboxamide
TypeSmall organic molecule
Emp. Form.C21H18BrFN4OS
Mol. Mass.473.361
SMILESNC[C@H](Cc1ccc(F)cc1)NC(=O)c1cc(Br)c(s1)-c1ccnc2[nH]ccc12