Reaction Details
TargetRAC-gamma serine/threonine-protein kinase
LigandBDBM50278099
Substrate/Competitorn/a
Meas. Tech.ChEMBL_565650 (CHEMBL959246)
IC50 1±n/a nM
Citation Seefeld, MARouse, MBMcNulty, KCSun, LWang, JYamashita, DSLuengo, JIZhang, SMinthorn, EAConcha, NOHeerding, DA Discovery of 5-pyrrolopyridinyl-2-thiophenecarboxamides as potent AKT kinase inhibitors. Bioorg Med Chem Lett19:2244-8 (2009) 
 
RAC-gamma serine/threonine-protein kinase
Name:RAC-gamma serine/threonine-protein kinase
Type:Enzyme
Mol. Mass.:55769.36
Organism:Homo sapiens (Human)
Description:n/a
Residue:479
BDBM50278099
NameBDBM50278099
Synonyms:CHEMBL482536 | N-((S)-1-amino-3-(3-(trifluoromethyl)phenyl)propan-2-yl)-4-bromo-5-(1H-pyrrolo[2,3-b]pyridin-4-yl)thiophene-2-carboxamide
TypeSmall organic molecule
Emp. Form.C22H18BrF3N4OS
Mol. Mass.523.369
SMILESNC[C@H](Cc1cccc(c1)C(F)(F)F)NC(=O)c1cc(Br)c(s1)-c1ccnc2[nH]ccc12