Reaction Details
TargetSerine/threonine-protein kinase pim-1
LigandBDBM50278836
Substrate/Competitorn/a
Meas. Tech.ChEMBL_565659 (CHEMBL959255)
IC50 794±n/a nM
Citation Seefeld, MARouse, MBMcNulty, KCSun, LWang, JYamashita, DSLuengo, JIZhang, SMinthorn, EAConcha, NOHeerding, DA Discovery of 5-pyrrolopyridinyl-2-thiophenecarboxamides as potent AKT kinase inhibitors. Bioorg Med Chem Lett19:2244-8 (2009) 
 
Serine/threonine-protein kinase pim-1
Name:Serine/threonine-protein kinase pim-1
Type:Protein
Mol. Mass.:35681.82
Organism:Homo sapiens (Human)
Description:P11309
Residue:313
BDBM50278836
NameBDBM50278836
Synonyms:CHEMBL523586 | N-((S)-1-amino-3-(3-fluorophenyl)propan-2-yl)-4-bromo-5-(1H-pyrrolo[2,3-b]pyridin-4-yl)thiophene-2-carboxamide
TypeSmall organic molecule
Emp. Form.C21H18BrFN4OS
Mol. Mass.473.361
SMILESNC[C@H](Cc1cccc(F)c1)NC(=O)c1cc(Br)c(s1)-c1ccnc2[nH]ccc12