Reaction Details
TargetRAC-alpha serine/threonine-protein kinase
LigandBDBM50278604
Substrate/Competitorn/a
Meas. Tech.ChEMBL_565646 (CHEMBL959242)
IC50 8±n/a nM
Citation Seefeld, MARouse, MBMcNulty, KCSun, LWang, JYamashita, DSLuengo, JIZhang, SMinthorn, EAConcha, NOHeerding, DA Discovery of 5-pyrrolopyridinyl-2-thiophenecarboxamides as potent AKT kinase inhibitors. Bioorg Med Chem Lett19:2244-8 (2009) 
 
RAC-alpha serine/threonine-protein kinase
Name:RAC-alpha serine/threonine-protein kinase
Type:Enzyme
Mol. Mass.:55681.25
Organism:Homo sapiens (Human)
Description:P31749
Residue:480
BDBM50278604
NameBDBM50278604
Synonyms:CHEMBL469781 | N-(2-amino-1-phenylethyl)-4-methyl-5-(1H-pyrrolo[2,3-b]pyridin-4-yl)thiophene-2-carboxamide
TypeSmall organic molecule
Emp. Form.C21H20N4OS
Mol. Mass.376.475
SMILESCc1cc(sc1-c1ccnc2[nH]ccc12)C(=O)NC(CN)c1ccccc1