Reaction Details
TargetRAC-alpha serine/threonine-protein kinase
LigandBDBM50278100
Substrate/Competitorn/a
Meas. Tech.ChEMBL_565646 (CHEMBL959242)
IC50 2±n/a nM
Citation Seefeld, MARouse, MBMcNulty, KCSun, LWang, JYamashita, DSLuengo, JIZhang, SMinthorn, EAConcha, NOHeerding, DA Discovery of 5-pyrrolopyridinyl-2-thiophenecarboxamides as potent AKT kinase inhibitors. Bioorg Med Chem Lett19:2244-8 (2009) 
 
RAC-alpha serine/threonine-protein kinase
Name:RAC-alpha serine/threonine-protein kinase
Type:Enzyme
Mol. Mass.:55681.25
Organism:Homo sapiens (Human)
Description:P31749
Residue:480
BDBM50278100
NameBDBM50278100
Synonyms:CHEMBL482537 | N-((S)-1-amino-3-(4-(trifluoromethyl)phenyl)propan-2-yl)-4-bromo-5-(1H-pyrrolo[2,3-b]pyridin-4-yl)thiophene-2-carboxamide
TypeSmall organic molecule
Emp. Form.C22H18BrF3N4OS
Mol. Mass.523.369
SMILESNC[C@H](Cc1ccc(cc1)C(F)(F)F)NC(=O)c1cc(Br)c(s1)-c1ccnc2[nH]ccc12