Reaction Details
TargetHistone deacetylase 7
LigandBDBM50278221
Substrate/Competitorn/a
Meas. Tech.ChEMBL_565679 (CHEMBL960037)
IC50 36300±n/a nM
Citation Giannini, GMarzi, MPezzi, RBrunetti, TBattistuzzi, GMarzo, MDCabri, WVesci, LPisano, C N-Hydroxy-(4-oxime)-cinnamide: a versatile scaffold for the synthesis of novel histone deacetylase [correction of deacetilase] (HDAC) inhibitors. Bioorg Med Chem Lett19:2346-9 (2009) 
 
Histone deacetylase 7
Name:Histone deacetylase 7
Type:Chromatin regulator; hydrolase; repressor
Mol. Mass.:102942.62
Organism:Homo sapiens (Human)
Description:Q8WUI4
Residue:952
BDBM50278221
NameBDBM50278221
Synonyms:CHEMBL471043 | methyl 4-((4-(3-(hydroxyamino)-3-oxoprop-1-enyl)benzylideneaminooxy)methyl)benzoate
TypeSmall organic molecule
Emp. Form.C19H18N2O5
Mol. Mass.354.3566
SMILESCOC(=O)c1ccc(CO\N=C\c2ccc(\C=C\C(=O)NO)cc2)cc1