Reaction Details
TargetHistone deacetylase 3
LigandBDBM50278222
Substrate/Competitorn/a
Meas. Tech.ChEMBL_565675 (CHEMBL960033)
IC50 4080±n/a nM
Citation Giannini, GMarzi, MPezzi, RBrunetti, TBattistuzzi, GMarzo, MDCabri, WVesci, LPisano, C N-Hydroxy-(4-oxime)-cinnamide: a versatile scaffold for the synthesis of novel histone deacetylase [correction of deacetilase] (HDAC) inhibitors. Bioorg Med Chem Lett19:2346-9 (2009) 
 
Histone deacetylase 3
Name:Histone deacetylase 3
Type:Enzyme
Mol. Mass.:48829.55
Organism:Homo sapiens (Human)
Description:O15379
Residue:428
BDBM50278222
NameBDBM50278222
Synonyms:CHEMBL472631 ST-3050
TypeSmall organic molecule
Emp. Form.C16H21N3O4
Mol. Mass.319.3556
SMILESONC(=O)\C=C\c1ccc(\C=N\OCCN2CCOCC2)cc1