Reaction Details
TargetHistamine H3 receptor
LigandBDBM50247053
Substrate/Competitorn/a
Meas. Tech.ChEMBL_501237 (CHEMBL975272)
Ki 2.7±n/a nM
Citation Isensee, KAmon, MGarlapati, AGalaparti, ALigneau, XCamelin, JCCapet, MSchwartz, JCStark, H Fluorinated non-imidazole histamine H3 receptor antagonists. Bioorg Med Chem Lett19:2172-5 (2009) 
 
Histamine H3 receptor
Name:Histamine H3 receptor
Type:G Protein-Coupled Receptor (GPCR)
Mol. Mass.:48691.47
Organism:Homo sapiens (Human)
Description:Binding assays were using CHO cells stably expressing hH3R receptors.
Residue:445
BDBM50247053
NameBDBM50247053
Synonyms:1-(3-(3-(4-chlorophenyl)propoxy)propyl)piperidine Tiprolisant
TypeSmall organic molecule
Emp. Form.C17H26ClNO
Mol. Mass.295.847
SMILESClc1ccc(CCCOCCCN2CCCCC2)cc1