Reaction Details
TargetHistamine H3 receptor
LigandBDBM50133003
Substrate/Competitorn/a
Meas. Tech.ChEMBL_501237 (CHEMBL975272)
Ki 11±n/a nM
Citation Isensee, KAmon, MGarlapati, AGalaparti, ALigneau, XCamelin, JCCapet, MSchwartz, JCStark, H Fluorinated non-imidazole histamine H3 receptor antagonists. Bioorg Med Chem Lett19:2172-5 (2009) 
 
Histamine H3 receptor
Name:Histamine H3 receptor
Type:G Protein-Coupled Receptor (GPCR)
Mol. Mass.:48691.47
Organism:Homo sapiens (Human)
Description:Binding assays were using CHO cells stably expressing hH3R receptors.
Residue:445
BDBM50133003
NameBDBM50133003
Synonyms:4-(3-(piperidin-1-yl)propoxy)benzonitrile CHEMBL129257 | UCL-2138
TypeSmall organic molecule
Emp. Form.C15H20N2O
Mol. Mass.244.3321
SMILESN#Cc1ccc(OCCCN2CCCCC2)cc1