Reaction Details
TargetMetabotropic glutamate receptor 1
LigandBDBM50278850
Substrate/Competitorn/a
Meas. Tech.ChEMBL_501594 (CHEMBL987723)
Ki 199±n/a nM
Citation Mantell, SJGibson, KROsborne, SAMaw, GNRees, HDodd, PGGreener, BHarbottle, GWMillion, WAPoinsard, CEngland, SCarnell, PBetts, AMMonhemius, RPrime, RL In vitro and in vivo SAR of pyrido[3,4-d]pyramid-4-ylamine based mGluR1 antagonists. Bioorg Med Chem Lett19:2190-4 (2009) 
 
Metabotropic glutamate receptor 1
Name:Metabotropic glutamate receptor 1
Type:Enzyme Catalytic Domain
Mol. Mass.:133240.47
Organism:RAT
Description:metabotropic glutamate 1/2 0 RAT::P23385
Residue:1199
BDBM50278850
NameBDBM50278850
Synonyms:CHEMBL497918 | N4-cyclohexyl-N6,N6-dimethylpyrido[3,4-d]pyrimidine-4,6-diamine
TypeSmall organic molecule
Emp. Form.C15H21N5
Mol. Mass.271.3607
SMILESCN(C)c1cc2c(NC3CCCCC3)ncnc2cn1