Reaction Details
TargetMetabotropic glutamate receptor 1
LigandBDBM50278229
Substrate/Competitorn/a
Meas. Tech.ChEMBL_501594 (CHEMBL987723)
Ki 125±n/a nM
Citation Mantell, SJGibson, KROsborne, SAMaw, GNRees, HDodd, PGGreener, BHarbottle, GWMillion, WAPoinsard, CEngland, SCarnell, PBetts, AMMonhemius, RPrime, RL In vitro and in vivo SAR of pyrido[3,4-d]pyramid-4-ylamine based mGluR1 antagonists. Bioorg Med Chem Lett19:2190-4 (2009) 
 
Metabotropic glutamate receptor 1
Name:Metabotropic glutamate receptor 1
Type:Enzyme Catalytic Domain
Mol. Mass.:133240.47
Organism:RAT
Description:metabotropic glutamate 1/2 0 RAT::P23385
Residue:1199
BDBM50278229
NameBDBM50278229
Synonyms:2-(6-(2,3-dihydro-1H-inden-2-ylamino)pyrido[3,4-d]pyrimidin-4-ylamino)ethanol | CHEMBL513032
TypeSmall organic molecule
Emp. Form.C18H19N5O
Mol. Mass.321.3764
SMILESOCCNc1ncnc2cnc(NC3Cc4ccccc4C3)cc12