Reaction Details
TargetMetabotropic glutamate receptor 1
LigandBDBM50278362
Substrate/Competitorn/a
Meas. Tech.ChEMBL_501594 (CHEMBL987723)
Ki 42±n/a nM
Citation Mantell, SJGibson, KROsborne, SAMaw, GNRees, HDodd, PGGreener, BHarbottle, GWMillion, WAPoinsard, CEngland, SCarnell, PBetts, AMMonhemius, RPrime, RL In vitro and in vivo SAR of pyrido[3,4-d]pyramid-4-ylamine based mGluR1 antagonists. Bioorg Med Chem Lett19:2190-4 (2009) 
 
Metabotropic glutamate receptor 1
Name:Metabotropic glutamate receptor 1
Type:Enzyme Catalytic Domain
Mol. Mass.:133240.47
Organism:RAT
Description:metabotropic glutamate 1/2 0 RAT::P23385
Residue:1199
BDBM50278362
NameBDBM50278362
Synonyms:CHEMBL512523 | N-cyclohexyl-6-(2-morpholinoethoxy)pyrido[3,4-d]pyrimidin-4-amine
TypeSmall organic molecule
Emp. Form.C19H27N5O2
Mol. Mass.357.45
SMILESC(CN1CCOCC1)Oc1cc2c(NC3CCCCC3)ncnc2cn1