Reaction Details
TargetChitinase A
LigandBDBM50257240
Substrate/Competitorn/a
Meas. Tech.ChEMBL_562669 (CHEMBL1011828)
IC50 140±n/a nM
Citation Sunazuka, TSugawara, AIguchi, KHirose, TNagai, KNoguchi, YSaito, YYamamoto, TUi, HGouda, HShiomi, KWatanabe, TOmura, S Argifin; efficient solid phase total synthesis and evaluation of analogues of acyclic peptide. Bioorg Med Chem17:2751-8 (2009) 
 
Chitinase A
Name:Chitinase A
Type:PROTEIN
Mol. Mass.:60981.21
Organism:Serratia marcescens
Description:ChEMBL_562669
Residue:563
BDBM50257240
NameBDBM50257240
Synonyms:CHEMBL450552 | N-Ac-Arg{N-omega-(N-methylcarbanoyl)}-N-methyl-Phe-Asp(OAllyl)-OH
TypeSmall organic molecule
Emp. Form.C27H39N7O8
Mol. Mass.589.6407
SMILESCNC(=O)NC(N)=NCCC[C@H](NC(C)=O)C(=O)N(C)[C@@H](Cc1ccccc1)C(=O)N[C@@H](CC(=O)OCC=C)C(O)=O