Reaction Details
TargetChitinase A
LigandBDBM50257245
Substrate/Competitorn/a
Meas. Tech.ChEMBL_562669 (CHEMBL1011828)
IC50 8400±n/a nM
Citation Sunazuka, TSugawara, AIguchi, KHirose, TNagai, KNoguchi, YSaito, YYamamoto, TUi, HGouda, HShiomi, KWatanabe, TOmura, S Argifin; efficient solid phase total synthesis and evaluation of analogues of acyclic peptide. Bioorg Med Chem17:2751-8 (2009) 
 
Chitinase A
Name:Chitinase A
Type:PROTEIN
Mol. Mass.:60981.21
Organism:Serratia marcescens
Description:ChEMBL_562669
Residue:563
BDBM50257245
NameBDBM50257245
Synonyms:CHEMBL449892 | N-Ac-Asp-D-Ala-Arg{N-omega-(N-methylcarbanoyl)}-N-methyl-Phe-OH
TypeSmall organic molecule
Emp. Form.C27H40N8O9
Mol. Mass.620.6547
SMILESCNC(=O)NC(N)=NCCC[C@H](NC(=O)[C@@H](C)NC(=O)[C@H](CC(O)=O)NC(C)=O)C(=O)N(C)[C@@H](Cc1ccccc1)C(O)=O