Reaction Details
TargetChitinase B
LigandBDBM50257241
Substrate/Competitorn/a
Meas. Tech.ChEMBL_562670 (CHEMBL1011829)
IC50 91±n/a nM
Citation Sunazuka, TSugawara, AIguchi, KHirose, TNagai, KNoguchi, YSaito, YYamamoto, TUi, HGouda, HShiomi, KWatanabe, TOmura, S Argifin; efficient solid phase total synthesis and evaluation of analogues of acyclic peptide. Bioorg Med Chem17:2751-8 (2009) 
 
Chitinase B
Name:Chitinase B
Type:Enzyme
Mol. Mass.:55462.70
Organism:Serratia marcescens
Description:P11797
Residue:499
BDBM50257241
NameBDBM50257241
Synonyms:CHEMBL506684 | N-Ac-D-Ala-Arg{N-omega-(N-methylcarbanoyl)}-N-methyl-Phe-Asp(OAllyl)-OH
TypeSmall organic molecule
Emp. Form.C30H44N8O9
Mol. Mass.660.7186
SMILESCNC(=O)NC(N)=NCCC[C@H](NC(=O)[C@@H](C)NC(C)=O)C(=O)N(C)[C@@H](Cc1ccccc1)C(=O)N[C@@H](CC(=O)OCC=C)C(O)=O