Reaction Details
TargetChitinase C1
LigandBDBM50257293
Substrate/Competitorn/a
Meas. Tech.ChEMBL_562671 (CHEMBL1011830)
IC50>30000±n/a nM
Citation Sunazuka, TSugawara, AIguchi, KHirose, TNagai, KNoguchi, YSaito, YYamamoto, TUi, HGouda, HShiomi, KWatanabe, TOmura, S Argifin; efficient solid phase total synthesis and evaluation of analogues of acyclic peptide. Bioorg Med Chem17:2751-8 (2009) 
 
Chitinase C1
Name:Chitinase C1
Synonyms:n/a
Type:PROTEIN
Mol. Mass.:51761.96
Organism:Serratia marcescens
Description:ChEMBL_562671
Residue:480
BDBM50257293
NameBDBM50257293
TypeSmall organic molecule
Emp. Form.C17H29N7O8
Mol. Mass.459.4543
SMILESCNC(=O)NC(N)=NCCC[C@H](NC(=O)[C@@H](C)NC(=O)[C@H](CC(O)=O)NC(C)=O)C(O)=O