Reaction Details
TargetProstaglandin D2 receptor
LigandBDBM50277447
Substrate/Competitorn/a
Meas. Tech.ChEMBL_501282 (CHEMBL971468)
Ki 14±n/a nM
Citation Leblanc, YRoy, PDufresne, CLachance, NWang, ZO'Neill, GGreig, GDenis, DMathieu, MCSlipetz, DSawyer, NTsou, N Discovery of potent and selective DP1 receptor antagonists in the azaindole series. Bioorg Med Chem Lett19:2125-8 (2009) 
 
Prostaglandin D2 receptor
Name:Prostaglandin D2 receptor
Type:Enzyme
Mol. Mass.:40288.87
Organism:Homo sapiens (Human)
Description:Q13258
Residue:359
BDBM50277447
NameBDBM50277447
Synonyms:2-(9-(3,4-dichlorophenylthio)-7,8-dihydro-6H-pyrido[3,4-b]pyrrolizin-8-yl)acetic acid | CHEMBL474702
TypeSmall organic molecule
Emp. Form.C18H14Cl2N2O2S
Mol. Mass.393.287
SMILESOC(=O)CC1CCn2c1c(Sc1ccc(Cl)c(Cl)c1)c1cnccc21