Reaction Details
TargetThromboxane A2 receptor
LigandBDBM50278036
Substrate/Competitorn/a
Meas. Tech.ChEMBL_501283 (CHEMBL971469)
Ki 3.8±n/a nM
Citation Leblanc, YRoy, PDufresne, CLachance, NWang, ZO'Neill, GGreig, GDenis, DMathieu, MCSlipetz, DSawyer, NTsou, N Discovery of potent and selective DP1 receptor antagonists in the azaindole series. Bioorg Med Chem Lett19:2125-8 (2009) 
 
Thromboxane A2 receptor
Name:Thromboxane A2 receptor
Type:Enyzme
Mol. Mass.:37445.28
Organism:Homo sapiens (Human)
Description:P21731
Residue:343
BDBM50278036
NameBDBM50278036
Synonyms:(+/-)-2-(5-(2,4-dichlorophenylthio)-4-(methylsulfonyl)-6,7,8,9-tetrahydropyrido[3,2-b]indolizin-6-yl)acetic acid | CHEMBL482547
TypeSmall organic molecule
Emp. Form.C20H18Cl2N2O4S2
Mol. Mass.485.404
SMILESCS(=O)(=O)c1ccnc2n3CCCC(CC(O)=O)c3c(Sc3ccc(Cl)cc3Cl)c12