Reaction Details
TargetMuscarinic acetylcholine receptor M3
LigandBDBM50003641
Substrate/Competitorn/a
Meas. Tech.ChEMBL_562970 (CHEMBL1015369)
IC50<10000±n/a nM
Citation Lainé, DIMcCleland, BThomas, SNeipp, CUnderwood, BDufour, JWiddowson, KLPalovich, MRBlaney, FEFoley, JJWebb, EFLuttmann, MABurman, MBelmonte, KSalmon, M Discovery of novel 1-azoniabicyclo[2.2.2]octane muscarinic acetylcholine receptor antagonists. J Med Chem52:2493-505 (2009) 
 
Muscarinic acetylcholine receptor M3
Name:Muscarinic acetylcholine receptor M3
Type:Enzyme
Mol. Mass.:66151.03
Organism:Homo sapiens (Human)
Description:P20309
Residue:590
BDBM50003641
NameBDBM50003641
Synonyms:CHEMBL476434
TypeSmall organic molecule
Emp. Form.C30H36BrNO2
Mol. Mass.522.516
SMILES[Br-].Cc1cccc(COCC[N+]23CCC(CC2)(CC3)C(O)(c2ccccc2)c2ccccc2)c1