Reaction Details
TargetMuscarinic acetylcholine receptor M3
LigandBDBM50003625
Substrate/Competitorn/a
Meas. Tech.ChEMBL_562970 (CHEMBL1015369)
IC50<10000±n/a nM
Citation Lainé, DIMcCleland, BThomas, SNeipp, CUnderwood, BDufour, JWiddowson, KLPalovich, MRBlaney, FEFoley, JJWebb, EFLuttmann, MABurman, MBelmonte, KSalmon, M Discovery of novel 1-azoniabicyclo[2.2.2]octane muscarinic acetylcholine receptor antagonists. J Med Chem52:2493-505 (2009) 
 
Muscarinic acetylcholine receptor M3
Name:Muscarinic acetylcholine receptor M3
Type:Enzyme
Mol. Mass.:66151.03
Organism:Homo sapiens (Human)
Description:P20309
Residue:590
BDBM50003625
NameBDBM50003625
Synonyms:CHEMBL490237
TypeSmall organic molecule
Emp. Form.C29H33BrFNO2
Mol. Mass.526.48
SMILES[Br-].OC(c1ccccc1)(c1ccccc1)C12CC[N+](CCOCc3ccccc3F)(CC1)CC2