Reaction Details
TargetMuscarinic acetylcholine receptor M3
LigandBDBM50267470
Substrate/Competitorn/a
Meas. Tech.ChEMBL_562970 (CHEMBL1015369)
IC50 2824000±n/a nM
Citation Lainé, DIMcCleland, BThomas, SNeipp, CUnderwood, BDufour, JWiddowson, KLPalovich, MRBlaney, FEFoley, JJWebb, EFLuttmann, MABurman, MBelmonte, KSalmon, M Discovery of novel 1-azoniabicyclo[2.2.2]octane muscarinic acetylcholine receptor antagonists. J Med Chem52:2493-505 (2009) 
 
Muscarinic acetylcholine receptor M3
Name:Muscarinic acetylcholine receptor M3
Type:Enzyme
Mol. Mass.:66151.03
Organism:Homo sapiens (Human)
Description:P20309
Residue:590
BDBM50267470
NameBDBM50267470
Synonyms:3-[Hydroxy(diphenyl)methyl]-1-(2-phenylethyl)-1-azoniabicyclo[2.2.2]octane Bromide | CHEMBL516120
TypeSmall organic molecule
Emp. Form.C28H32NO
Mol. Mass.398.5592
SMILESOC(C1C[N+]2(CCc3ccccc3)CCC1CC2)(c1ccccc1)c1ccccc1