Reaction Details
TargetMuscarinic acetylcholine receptor M2
LigandBDBM50267614
Substrate/Competitorn/a
Meas. Tech.ChEMBL_562972 (CHEMBL1015371)
Ki 0.15±n/a nM
Citation Lainé, DIMcCleland, BThomas, SNeipp, CUnderwood, BDufour, JWiddowson, KLPalovich, MRBlaney, FEFoley, JJWebb, EFLuttmann, MABurman, MBelmonte, KSalmon, M Discovery of novel 1-azoniabicyclo[2.2.2]octane muscarinic acetylcholine receptor antagonists. J Med Chem52:2493-505 (2009) 
 
Muscarinic acetylcholine receptor M2
Name:Muscarinic acetylcholine receptor M2
Type:GPCR
Mol. Mass.:51730.61
Organism:Homo sapiens (Human)
Description:P08172
Residue:466
BDBM50267614
NameBDBM50267614
Synonyms:4-[Hydroxy(diphenyl)methyl]-1-{2-[(phenylmethyl)oxy]ethyl}-1-azoniabicyclo[2.2.2]octane Bromide GSK573719 Umeclidinium bromide incruse ellipta
TypeSmall organic molecule
Emp. Form.C29H34NO2
Mol. Mass.428.5852
SMILESOC(c1ccccc1)(c1ccccc1)C12CC[N+](CCOCc3ccccc3)(CC1)CC2