Reaction Details
TargetMuscarinic acetylcholine receptor M3
LigandBDBM50267389
Substrate/Competitorn/a
Meas. Tech.ChEMBL_562970 (CHEMBL1015369)
IC50 6599000±n/a nM
Citation Lainé, DIMcCleland, BThomas, SNeipp, CUnderwood, BDufour, JWiddowson, KLPalovich, MRBlaney, FEFoley, JJWebb, EFLuttmann, MABurman, MBelmonte, KSalmon, M Discovery of novel 1-azoniabicyclo[2.2.2]octane muscarinic acetylcholine receptor antagonists. J Med Chem52:2493-505 (2009) 
 
Muscarinic acetylcholine receptor M3
Name:Muscarinic acetylcholine receptor M3
Type:Enzyme
Mol. Mass.:66151.03
Organism:Homo sapiens (Human)
Description:P20309
Residue:590
BDBM50267389
NameBDBM50267389
Synonyms:2-(hydroxydiphenylmethyl)-1-azoniabicyclo[2.2.2]octane bromide | CHEMBL476435
TypeSmall organic molecule
Emp. Form.C20H24NO
Mol. Mass.294.4101
SMILESOC(C1CC2CC[NH+]1CC2)(c1ccccc1)c1ccccc1