Reaction Details
TargetCyclin-dependent kinase 4
LigandBDBM50267540
Substrate/Competitorn/a
Meas. Tech.ChEMBL_563013 (CHEMBL1016197)
IC50<5±n/a nM
Citation Tsou, HRLiu, XBirnberg, GKaplan, JOtteng, MTran, TKutterer, KTang, ZSuayan, RZask, ARavi, MBretz, AGrillo, MMcGinnis, JPRabindran, SKAyral-Kaloustian, SMansour, TS Discovery of 4-(benzylaminomethylene)isoquinoline-1,3-(2H,4H)-diones and 4-[(pyridylmethyl)aminomethylene]isoquinoline-1,3-(2H,4H)-diones as potent and selective inhibitors of the cyclin-dependent kinase 4. J Med Chem52:2289-310 (2009) 
 
Cyclin-dependent kinase 4
Name:Cyclin-dependent kinase 4
Type:Enzyme Subunit
Mol. Mass.:33731.96
Organism:Homo sapiens (Human)
Description:P11802
Residue:303
BDBM50267540
NameBDBM50267540
Synonyms:6-Cyclopentyl-4-{[(5-furan-3-yl-4-hydroxy-pyridin-2-ylmethyl)-amino]-methylene}-4H-isoquinoline-1,3-dione | CHEMBL490240
TypeSmall organic molecule
Emp. Form.C25H23N3O4
Mol. Mass.429.4678
SMILESOc1cc(CNC=C2C(=O)NC(=O)c3ccc(cc23)C2CCCC2)ncc1-c1ccoc1