Reaction Details
TargetCannabinoid receptor 1
LigandBDBM50253704
Substrate/Competitorn/a
Meas. Tech.ChEMBL_499986 (CHEMBL1022898)
EC50 400±n/a nM
Citation Srivastava, BKSoni, RPatel, JZJoharapurkar, ASadhwani, NKshirsagar, SMishra, BTakale, VGupta, SPandya, PKapadnis, PSolanki, MPatel, HMitra, PJain, MRPatel, PR Hair growth stimulator property of thienyl substituted pyrazole carboxamide derivatives as a CB1 receptor antagonist with in vivo antiobesity effect. Bioorg Med Chem Lett19:2546-50 (2009) 
 
Cannabinoid receptor 1
Name:Cannabinoid receptor 1
Type:G Protein-Coupled Receptor (GPCR)
Mol. Mass.:52868.96
Organism:Homo sapiens (Human)
Description:P21554
Residue:472
BDBM50253704
NameBDBM50253704
Synonyms:5-(5-bromothiophen-2-yl)-1-(2,4-dichlorophenyl)-4-methyl-N-(piperidin-1-yl)-1H-pyrazole-3-carboxamide | CHEMBL459309
TypeSmall organic molecule
Emp. Form.C20H19BrCl2N4OS
Mol. Mass.514.266
SMILESCc1c(nn(c1-c1ccc(Br)s1)-c1ccc(Cl)cc1Cl)C(=O)NN1CCCCC1