Reaction Details
Target5-hydroxytryptamine receptor 2A
LigandBDBM50277846
Substrate/Competitorn/a
Meas. Tech.ChEMBL_497613 (CHEMBL1002099)
Ki>3200±n/a nM
Citation Duplantier, AJEfremov, ICandler, JDoran, ACGanong, AHHaas, JAHanks, ANKraus, KGLazzaro, JTLu, JMaklad, NMcCarthy, SAO'Sullivan, TJRogers, BNSiuciak, JASpracklin, DKZhang, L 3-Benzyl-1,3-oxazolidin-2-ones as mGluR2 positive allosteric modulators: Hit-to lead and lead optimization. Bioorg Med Chem Lett19:2524-9 (2009) 
 
5-hydroxytryptamine receptor 2A
Name:5-hydroxytryptamine receptor 2A
Type:undefined
Mol. Mass.:52607.65
Organism:Homo sapiens (Human)
Description:P28223
Residue:471
BDBM50277846
NameBDBM50277846
Synonyms:(5R)-3-(4-(1-cyclohexylethoxy)benzyl)-5-methyloxazolidin-2-one | CHEMBL484340
TypeSmall organic molecule
Emp. Form.C19H27NO3
Mol. Mass.317.4226
SMILESCC(Oc1ccc(CN2C[C@@H](C)OC2=O)cc1)C1CCCCC1