Reaction Details
TargetMetabotropic glutamate receptor 2
LigandBDBM50277846
Substrate/Competitorn/a
Meas. Tech.ChEMBL_502279 (CHEMBL983950)
EC50 5±n/a nM
Citation Duplantier, AJEfremov, ICandler, JDoran, ACGanong, AHHaas, JAHanks, ANKraus, KGLazzaro, JTLu, JMaklad, NMcCarthy, SAO'Sullivan, TJRogers, BNSiuciak, JASpracklin, DKZhang, L 3-Benzyl-1,3-oxazolidin-2-ones as mGluR2 positive allosteric modulators: Hit-to lead and lead optimization. Bioorg Med Chem Lett19:2524-9 (2009) 
 
Metabotropic glutamate receptor 2
Name:Metabotropic glutamate receptor 2
Type:Enzyme
Mol. Mass.:95584.88
Organism:Homo sapiens (Human)
Description:Q14416
Residue:872
BDBM50277846
NameBDBM50277846
Synonyms:(5R)-3-(4-(1-cyclohexylethoxy)benzyl)-5-methyloxazolidin-2-one | CHEMBL484340
TypeSmall organic molecule
Emp. Form.C19H27NO3
Mol. Mass.317.4226
SMILESCC(Oc1ccc(CN2C[C@@H](C)OC2=O)cc1)C1CCCCC1