Reaction Details
TargetNeuronal acetylcholine receptor subunit alpha-7
LigandBDBM82070
Substrate/Competitorn/a
Meas. Tech.ChEMBL_563559 (CHEMBL961846)
Ki 1000±n/a nM
Citation Ulens, CAkdemir, AJongejan, Avan Elk, RBertrand, SPerrakis, ALeurs, RSmit, ABSixma, TKBertrand, Dde Esch, IJ Use of acetylcholine binding protein in the search for novel alpha7 nicotinic receptor ligands. In silico docking, pharmacological screening, and X-ray analysis. J Med Chem52:2372-83 (2009) 
 
Neuronal acetylcholine receptor subunit alpha-7
Name:Neuronal acetylcholine receptor subunit alpha-7
Type:n/a
Mol. Mass.:56448.33
Organism:Homo sapiens (Human)
Description: CHRNA7 (NACHRA7)
Residue:502
BDBM82070
NameBDBM82070
Synonyms:CAS_29790-52-1 Nicotine-D salicylate US9303017, Nicotine
Typen/a
Emp. Form.C10H14N2
Mol. Mass.162.2316
SMILESCN1CCC[C@H]1c1cccnc1