Reaction Details
TargetSignal transducer and activator of transcription 3
LigandBDBM50267441
Substrate/Competitorn/a
Meas. Tech.ChEMBL_563598 (CHEMBL962551)
IC50 136±n/a nM
Citation Mandal, PKLimbrick, DColeman, DRDyer, GARen, ZBirtwistle, JSXiong, CChen, XBriggs, JMMcMurray, JS Conformationally constrained peptidomimetic inhibitors of signal transducer and activator of transcription. 3: Evaluation and molecular modeling. J Med Chem52:2429-42 (2009) 
 
Signal transducer and activator of transcription 3
Name:Signal transducer and activator of transcription 3
Type:Protein
Mol. Mass.:88064.31
Organism:Homo sapiens (Human)
Description:P40763
Residue:770
BDBM50267441
NameBDBM50267441
Synonyms:CHEMBL470227 | pCinn-Leu-Pro-Gln-Thr-NH2
TypeSmall organic molecule
Emp. Form.C29H43N6O11P
Mol. Mass.682.6591
SMILESCC(C)C[C@H](NC(=O)\C=C\c1ccc(OP(O)(O)=O)cc1)C(=O)N1CCC[C@H]1C(=O)N[C@@H](CCC(N)=O)C(=O)N[C@@H]([C@@H](C)O)C(N)=O