Reaction Details
TargetSignal transducer and activator of transcription 3
LigandBDBM50198780
Substrate/Competitorn/a
Meas. Tech.ChEMBL_563598 (CHEMBL962551)
IC50 138±n/a nM
Citation Mandal, PKLimbrick, DColeman, DRDyer, GARen, ZBirtwistle, JSXiong, CChen, XBriggs, JMMcMurray, JS Conformationally constrained peptidomimetic inhibitors of signal transducer and activator of transcription. 3: Evaluation and molecular modeling. J Med Chem52:2429-42 (2009) 
 
Signal transducer and activator of transcription 3
Name:Signal transducer and activator of transcription 3
Type:Protein
Mol. Mass.:88064.31
Organism:Homo sapiens (Human)
Description:P40763
Residue:770
BDBM50198780
NameBDBM50198780
Synonyms:4-(3-((S)-1-((S)-2-((S)-5-amino-1-(benzylamino)-1,5-dioxopentan-2-ylcarbamoyl)pyrrolidin-1-yl)-4-methyl-1-oxopentan-2-ylamino)-3-oxoprop-1-enyl)phenyl dihydrogen phosphate pCin-Leu-Pro-Gln-NHBn | pCinn-Leu-Pro-Gln-NHBn
TypeSmall organic molecule
Emp. Form.C32H42N5O9P
Mol. Mass.671.6777
SMILESCC(C)C[C@H](NC(=O)\C=C\c1ccc(OP(O)(O)=O)cc1)C(=O)N1CCC[C@H]1C(=O)N[C@@H](CCC(N)=O)C(=O)NCc1ccccc1