Reaction Details
TargetSignal transducer and activator of transcription 3
LigandBDBM50267452
Substrate/Competitorn/a
Meas. Tech.ChEMBL_563598 (CHEMBL962551)
IC50 195±n/a nM
Citation Mandal, PKLimbrick, DColeman, DRDyer, GARen, ZBirtwistle, JSXiong, CChen, XBriggs, JMMcMurray, JS Conformationally constrained peptidomimetic inhibitors of signal transducer and activator of transcription. 3: Evaluation and molecular modeling. J Med Chem52:2429-42 (2009) 
 
Signal transducer and activator of transcription 3
Name:Signal transducer and activator of transcription 3
Type:Protein
Mol. Mass.:88064.31
Organism:Homo sapiens (Human)
Description:P40763
Residue:770
BDBM50267452
NameBDBM50267452
Synonyms:4-(3-((2S,5S,Z)-2-((S)-5-amino-1-(benzylamino)-1,5-dioxopentan-2-ylcarbamoyl)-4-oxo-1,2,4,5-tetrahydroazepino[3,2,1-hi]indol-5-ylamino)-3-oxoprop-1-enyl)phenyl dihydrogen phosphate | CHEMBL508912
TypeSmall organic molecule
Emp. Form.C34H34N5O9P
Mol. Mass.687.6356
SMILESNC(=O)CC[C@H](NC(=O)[C@@H]1Cc2cccc3C=C[C@H](NC(=O)\C=C\c4ccc(OP(O)(O)=O)cc4)C(=O)N1c23)C(=O)NCc1ccccc1