Reaction Details
TargetGlycogen synthase kinase-3 beta
LigandBDBM50267520
Substrate/Competitorn/a
Meas. Tech.ChEMBL_563639 (CHEMBL963374)
IC50 3.5±n/a nM
Citation Gaisina, INGallier, FOugolkov, AVKim, KHKurome, TGuo, SHolzle, DLuchini, DNBlond, SYBilladeau, DDKozikowski, AP From a natural product lead to the identification of potent and selective benzofuran-3-yl-(indol-3-yl)maleimides as glycogen synthase kinase 3beta inhibitors that suppress proliferation and survival of pancreatic cancer cells. J Med Chem52:1853-63 (2009) 
 
Glycogen synthase kinase-3 beta
Name:Glycogen synthase kinase-3 beta
Type:Enzyme
Mol. Mass.:46756.38
Organism:Homo sapiens (Human)
Description:P49841
Residue:420
BDBM50267520
NameBDBM50267520
Synonyms:3-(5-Fluoro-1-methyl-1H-indol-3-yl)-4-(6-hydroxybenzofuran-3-yl)pyrrole-2,5-dione | CHEMBL489210
TypeSmall organic molecule
Emp. Form.C21H13FN2O4
Mol. Mass.376.3373
SMILESCn1cc(C2=C(C(=O)NC2=O)c2coc3cc(O)ccc23)c2cc(F)ccc12