Reaction Details
TargetCyclin-dependent kinase 2
LigandBDBM50267759
Substrate/Competitorn/a
Meas. Tech.ChEMBL_563640 (CHEMBL963375)
IC50 27±n/a nM
Citation Gaisina, INGallier, FOugolkov, AVKim, KHKurome, TGuo, SHolzle, DLuchini, DNBlond, SYBilladeau, DDKozikowski, AP From a natural product lead to the identification of potent and selective benzofuran-3-yl-(indol-3-yl)maleimides as glycogen synthase kinase 3beta inhibitors that suppress proliferation and survival of pancreatic cancer cells. J Med Chem52:1853-63 (2009) 
 
Cyclin-dependent kinase 2
Name:Cyclin-dependent kinase 2
Type:Enzyme Subunit
Mol. Mass.:33938.17
Organism:Homo sapiens (Human)
Description:P24941
Residue:298
BDBM50267759
NameBDBM50267759
Synonyms:3-(6-Hydroxymethylbenzofuran-3-yl)-4-(7-hydroxymethyl-1-methyl-1H-indol-3-yl)pyrrole-2,5-dione | CHEMBL491447
TypeSmall organic molecule
Emp. Form.C23H18N2O5
Mol. Mass.402.3994
SMILESCn1cc(C2=C(C(=O)NC2=O)c2coc3cc(CO)ccc23)c2cccc(CO)c12