Reaction Details
TargetNociceptin receptor
LigandBDBM50259103
Substrate/Competitorn/a
Meas. Tech.ChEMBL_500674 (CHEMBL966890)
Ki 3±n/a nM
Citation Ho, GDAnthes, JBercovici, ACaldwell, JPCheng, KCCui, XFawzi, AFernandez, XGreenlee, WJHey, JKorfmacher, WLu, SXMcLeod, RLNg, FTorhan, ASTan, ZTulshian, DVarty, GBXu, XZhang, H The discovery of tropane derivatives as nociceptin receptor ligands for the management of cough and anxiety. Bioorg Med Chem Lett19:2519-23 (2009) 
 
Nociceptin receptor
Name:Nociceptin receptor
Type:G Protein-Coupled Receptor (GPCR)
Mol. Mass.:40702.87
Organism:Homo sapiens (Human)
Description:P41146
Residue:370
BDBM50259103
NameBDBM50259103
Synonyms:8-((2-chloro-4-methylphenyl)(2-chlorophenyl)methyl)-3-(1,4,5,6-tetrahydropyrimidin-2-yl)-8-azabicyclo[3.2.1]octan-3-ol | CHEMBL466679
TypeSmall organic molecule
Emp. Form.C25H29Cl2N3O
Mol. Mass.458.423
SMILESCc1ccc(C(N2C3CCC2CC(O)(C3)C2=NCCCN2)c2ccccc2Cl)c(Cl)c1