Reaction Details
TargetNociceptin receptor
LigandBDBM50259286
Substrate/Competitorn/a
Meas. Tech.ChEMBL_500674 (CHEMBL966890)
Ki 16±n/a nM
Citation Ho, GDAnthes, JBercovici, ACaldwell, JPCheng, KCCui, XFawzi, AFernandez, XGreenlee, WJHey, JKorfmacher, WLu, SXMcLeod, RLNg, FTorhan, ASTan, ZTulshian, DVarty, GBXu, XZhang, H The discovery of tropane derivatives as nociceptin receptor ligands for the management of cough and anxiety. Bioorg Med Chem Lett19:2519-23 (2009) 
 
Nociceptin receptor
Name:Nociceptin receptor
Type:G Protein-Coupled Receptor (GPCR)
Mol. Mass.:40702.87
Organism:Homo sapiens (Human)
Description:P41146
Residue:370
BDBM50259286
NameBDBM50259286
Synonyms:8-(bis(2-chlorophenyl)methyl)-3-(4-fluorophenyl)-8-azabicyclo[3.2.1]octane-3-carboxamide | CHEMBL466921
TypeSmall organic molecule
Emp. Form.C27H25Cl2FN2O
Mol. Mass.483.405
SMILESNC(=O)C1(CC2CCC(C1)N2C(c1ccccc1Cl)c1ccccc1Cl)c1ccc(F)cc1