Reaction Details
TargetNociceptin receptor
LigandBDBM50259283
Substrate/Competitorn/a
Meas. Tech.ChEMBL_500674 (CHEMBL966890)
Ki 11±n/a nM
Citation Ho, GDAnthes, JBercovici, ACaldwell, JPCheng, KCCui, XFawzi, AFernandez, XGreenlee, WJHey, JKorfmacher, WLu, SXMcLeod, RLNg, FTorhan, ASTan, ZTulshian, DVarty, GBXu, XZhang, H The discovery of tropane derivatives as nociceptin receptor ligands for the management of cough and anxiety. Bioorg Med Chem Lett19:2519-23 (2009) 
 
Nociceptin receptor
Name:Nociceptin receptor
Type:G Protein-Coupled Receptor (GPCR)
Mol. Mass.:40702.87
Organism:Homo sapiens (Human)
Description:P41146
Residue:370
BDBM50259283
NameBDBM50259283
Synonyms:CHEMBL466919 | N-(8-(bis(2-chlorophenyl)methyl)-3-phenyl-8-azabicyclo[3.2.1]octan-3-yl)cyclopropanecarboxamide
TypeSmall organic molecule
Emp. Form.C30H30Cl2N2O
Mol. Mass.505.478
SMILESClc1ccccc1C(N1C2CCC1CC(C2)(NC(=O)C1CC1)c1ccccc1)c1ccccc1Cl