Reaction Details
TargetNociceptin receptor
LigandBDBM50258920
Substrate/Competitorn/a
Meas. Tech.ChEMBL_500674 (CHEMBL966890)
Ki 198±n/a nM
Citation Ho, GDAnthes, JBercovici, ACaldwell, JPCheng, KCCui, XFawzi, AFernandez, XGreenlee, WJHey, JKorfmacher, WLu, SXMcLeod, RLNg, FTorhan, ASTan, ZTulshian, DVarty, GBXu, XZhang, H The discovery of tropane derivatives as nociceptin receptor ligands for the management of cough and anxiety. Bioorg Med Chem Lett19:2519-23 (2009) 
 
Nociceptin receptor
Name:Nociceptin receptor
Type:G Protein-Coupled Receptor (GPCR)
Mol. Mass.:40702.87
Organism:Homo sapiens (Human)
Description:P41146
Residue:370
BDBM50258920
NameBDBM50258920
Synonyms:8-(bis(2-chlorophenyl)methyl)-8-azabicyclo[3.2.1]octan-3-ol | CHEMBL466438
TypeSmall organic molecule
Emp. Form.C20H21Cl2NO
Mol. Mass.362.293
SMILESOC1CC2CCC(C1)N2C(c1ccccc1Cl)c1ccccc1Cl