Reaction Details
TargetMu-type opioid receptor
LigandBDBM50259238
Substrate/Competitorn/a
Meas. Tech.ChEMBL_500678 (CHEMBL966894)
EC50 4525±n/a nM
Citation Ho, GDAnthes, JBercovici, ACaldwell, JPCheng, KCCui, XFawzi, AFernandez, XGreenlee, WJHey, JKorfmacher, WLu, SXMcLeod, RLNg, FTorhan, ASTan, ZTulshian, DVarty, GBXu, XZhang, H The discovery of tropane derivatives as nociceptin receptor ligands for the management of cough and anxiety. Bioorg Med Chem Lett19:2519-23 (2009) 
 
Mu-type opioid receptor
Name:Mu-type opioid receptor
Type:G Protein-Coupled Receptor (GPCR)
Mol. Mass.:44789.51
Organism:Homo sapiens (Human)
Description:P35372
Residue:400
BDBM50259238
NameBDBM50259238
Synonyms:8-(bis(2-chlorophenyl)methyl)-3-phenyl-8-azabicyclo[3.2.1]octan-3-amine | CHEMBL512258
TypeSmall organic molecule
Emp. Form.C26H26Cl2N2
Mol. Mass.437.404
SMILESNC1(CC2CCC(C1)N2C(c1ccccc1Cl)c1ccccc1Cl)c1ccccc1