Reaction Details
TargetMu-type opioid receptor
LigandBDBM50259053
Substrate/Competitorn/a
Meas. Tech.ChEMBL_500678 (CHEMBL966894)
EC50 894±n/a nM
Citation Ho, GDAnthes, JBercovici, ACaldwell, JPCheng, KCCui, XFawzi, AFernandez, XGreenlee, WJHey, JKorfmacher, WLu, SXMcLeod, RLNg, FTorhan, ASTan, ZTulshian, DVarty, GBXu, XZhang, H The discovery of tropane derivatives as nociceptin receptor ligands for the management of cough and anxiety. Bioorg Med Chem Lett19:2519-23 (2009) 
 
Mu-type opioid receptor
Name:Mu-type opioid receptor
Type:G Protein-Coupled Receptor (GPCR)
Mol. Mass.:44789.51
Organism:Homo sapiens (Human)
Description:P35372
Residue:400
BDBM50259053
NameBDBM50259053
Synonyms:8-((2-chloro-4-methylphenyl)(2-chlorophenyl)methyl)-3-(3-fluorophenyl)-8-azabicyclo[3.2.1]octan-3-ol | CHEMBL467488
TypeSmall organic molecule
Emp. Form.C27H26Cl2FNO
Mol. Mass.470.406
SMILESCc1ccc(C(N2C3CCC2CC(O)(C3)c2cccc(F)c2)c2ccccc2Cl)c(Cl)c1