Reaction Details
TargetNociceptin receptor
LigandBDBM50259615
Substrate/Competitorn/a
Meas. Tech.ChEMBL_500674 (CHEMBL966890)
Ki 142±n/a nM
Citation Ho, GDAnthes, JBercovici, ACaldwell, JPCheng, KCCui, XFawzi, AFernandez, XGreenlee, WJHey, JKorfmacher, WLu, SXMcLeod, RLNg, FTorhan, ASTan, ZTulshian, DVarty, GBXu, XZhang, H The discovery of tropane derivatives as nociceptin receptor ligands for the management of cough and anxiety. Bioorg Med Chem Lett19:2519-23 (2009) 
 
Nociceptin receptor
Name:Nociceptin receptor
Type:G Protein-Coupled Receptor (GPCR)
Mol. Mass.:40702.87
Organism:Homo sapiens (Human)
Description:P41146
Residue:370
BDBM50259615
NameBDBM50259615
Synonyms:(3R,4S)-1-benzhydryl-3-methyl-4-phenylpiperidin-4-ol | CHEMBL467933
TypeSmall organic molecule
Emp. Form.C25H27NO
Mol. Mass.357.488
SMILESC[C@@H]1CN(CC[C@@]1(O)c1ccccc1)C(c1ccccc1)c1ccccc1