Reaction Details
TargetNociceptin receptor
LigandBDBM50259013
Substrate/Competitorn/a
Meas. Tech.ChEMBL_500674 (CHEMBL966890)
Ki 3±n/a nM
Citation Ho, GDAnthes, JBercovici, ACaldwell, JPCheng, KCCui, XFawzi, AFernandez, XGreenlee, WJHey, JKorfmacher, WLu, SXMcLeod, RLNg, FTorhan, ASTan, ZTulshian, DVarty, GBXu, XZhang, H The discovery of tropane derivatives as nociceptin receptor ligands for the management of cough and anxiety. Bioorg Med Chem Lett19:2519-23 (2009) 
 
Nociceptin receptor
Name:Nociceptin receptor
Type:G Protein-Coupled Receptor (GPCR)
Mol. Mass.:40702.87
Organism:Homo sapiens (Human)
Description:P41146
Residue:370
BDBM50259013
NameBDBM50259013
Synonyms:8-(bis(2-chlorophenyl)methyl)-3-(pyridin-3-yl)-8-azabicyclo[3.2.1]octan-3-ol | CHEMBL511374
TypeSmall organic molecule
Emp. Form.C25H24Cl2N2O
Mol. Mass.439.377
SMILESOC1(CC2CCC(C1)N2C(c1ccccc1Cl)c1ccccc1Cl)c1cccnc1