Reaction Details
TargetMu-type opioid receptor
LigandBDBM50259614
Substrate/Competitorn/a
Meas. Tech.ChEMBL_500675 (CHEMBL966891)
Ki 7255±n/a nM
Citation Ho, GDAnthes, JBercovici, ACaldwell, JPCheng, KCCui, XFawzi, AFernandez, XGreenlee, WJHey, JKorfmacher, WLu, SXMcLeod, RLNg, FTorhan, ASTan, ZTulshian, DVarty, GBXu, XZhang, H The discovery of tropane derivatives as nociceptin receptor ligands for the management of cough and anxiety. Bioorg Med Chem Lett19:2519-23 (2009) 
 
Mu-type opioid receptor
Name:Mu-type opioid receptor
Type:G Protein-Coupled Receptor (GPCR)
Mol. Mass.:44789.51
Organism:Homo sapiens (Human)
Description:P35372
Residue:400
BDBM50259614
NameBDBM50259614
Synonyms:3-(bis(2-chlorophenyl)methyl)-8-(pyridin-3-yl)-3-azabicyclo[3.2.1]octan-8-ol | CHEMBL512982
TypeSmall organic molecule
Emp. Form.C25H24Cl2N2O
Mol. Mass.439.377
SMILESOC1(C2CCC1CN(C2)C(c1ccccc1Cl)c1ccccc1Cl)c1cccnc1