Reaction Details
TargetMu-type opioid receptor
LigandBDBM50259285
Substrate/Competitorn/a
Meas. Tech.ChEMBL_500675 (CHEMBL966891)
Ki 601±n/a nM
Citation Ho, GDAnthes, JBercovici, ACaldwell, JPCheng, KCCui, XFawzi, AFernandez, XGreenlee, WJHey, JKorfmacher, WLu, SXMcLeod, RLNg, FTorhan, ASTan, ZTulshian, DVarty, GBXu, XZhang, H The discovery of tropane derivatives as nociceptin receptor ligands for the management of cough and anxiety. Bioorg Med Chem Lett19:2519-23 (2009) 
 
Mu-type opioid receptor
Name:Mu-type opioid receptor
Type:G Protein-Coupled Receptor (GPCR)
Mol. Mass.:44789.51
Organism:Homo sapiens (Human)
Description:P35372
Residue:400
BDBM50259285
NameBDBM50259285
Synonyms:8-(bis(2-chlorophenyl)methyl)-3-phenyl-8-azabicyclo[3.2.1]octane-3-carbaldehyde oxime | CHEMBL467119
TypeSmall organic molecule
Emp. Form.C27H26Cl2N2O
Mol. Mass.465.414
SMILESClc1ccccc1C(N1C2CCC1CC(CN=O)(C2)c1ccccc1)c1ccccc1Cl