Reaction Details
TargetKappa-type opioid receptor
LigandBDBM50259236
Substrate/Competitorn/a
Meas. Tech.ChEMBL_500679 (CHEMBL966895)
Ki 268±n/a nM
Citation Ho, GDAnthes, JBercovici, ACaldwell, JPCheng, KCCui, XFawzi, AFernandez, XGreenlee, WJHey, JKorfmacher, WLu, SXMcLeod, RLNg, FTorhan, ASTan, ZTulshian, DVarty, GBXu, XZhang, H The discovery of tropane derivatives as nociceptin receptor ligands for the management of cough and anxiety. Bioorg Med Chem Lett19:2519-23 (2009) 
 
Kappa-type opioid receptor
Name:Kappa-type opioid receptor
Type:G Protein-Coupled Receptor (GPCR)
Mol. Mass.:42648.76
Organism:Homo sapiens (Human)
Description:P41145
Residue:380
BDBM50259236
NameBDBM50259236
Synonyms:8-(bis(2-chlorophenyl)methyl)-3-phenyl-8-azabicyclo[3.2.1]octane-3-carboxamide | CHEMBL512414
TypeSmall organic molecule
Emp. Form.C27H26Cl2N2O
Mol. Mass.465.414
SMILESNC(=O)C1(CC2CCC(C1)N2C(c1ccccc1Cl)c1ccccc1Cl)c1ccccc1