Reaction Details
TargetEpidermal growth factor receptor
LigandBDBM50277623
Substrate/Competitorn/a
Meas. Tech.ChEMBL_501537 (CHEMBL984177)
IC50 5400±n/a nM
Citation Cirillo, PFHickey, ERMoss, NBreitfelder, SBetageri, RFadra, TGaenzler, FGilmore, TGoldberg, DRKamhi, VKirrane, TKroe, RRMadwed, JMoriak, MNetherton, MPargellis, CAPatel, URQian, KCSharma, RSun, SSwinamer, ATorcellini, CTakahashi, HTsang, MXiong, Z Discovery and characterization of the N-phenyl-N'-naphthylurea class of p38 kinase inhibitors. Bioorg Med Chem Lett19:2386-91 (2009) 
 
Epidermal growth factor receptor
Name:Epidermal growth factor receptor
Type:Receptor Kinase Domain
Mol. Mass.:134279.59
Organism:Homo sapiens (Human)
Description:P00533
Residue:1210
BDBM50277623
NameBDBM50277623
Synonyms:CHEMBL451523 N-{5-tert-butyl-2-methoxy-3-[({4-[6-(morpholin-4-ylmethyl)pyridin-3-yl]naphthalen-1-yl}carbamoyl)amino]phenyl}methanesulfonamide
TypeSmall organic molecule
Emp. Form.C33H39N5O5S
Mol. Mass.617.758
SMILESCOc1c(NC(=O)Nc2ccc(-c3ccc(CN4CCOCC4)nc3)c3ccccc23)cc(cc1NS(C)(=O)=O)C(C)(C)C